Reaction Details
TargetSerine/threonine-protein kinase PLK1
LigandBDBM50350423
Substrate/Competitorn/a
Meas. Tech.ChEMBL_762504 (CHEMBL1816874)
IC50 75700±n/a nM
Citation Ebada, SSSchulz, BWray, VTotzke, FKubbutat, MHMüller, WEHamacher, AKassack, MULin, WProksch, P Arthrinins A-D: novel diterpenoids and further constituents from the sponge derived fungus Arthrinium sp. Bioorg Med Chem19:4644-51 (2011) 
 
Serine/threonine-protein kinase PLK1
Name:Serine/threonine-protein kinase PLK1
Type:Serine/threonine-protein kinase
Mol. Mass.:68277.16
Organism:Homo sapiens (Human)
Description:P53350
Residue:603
BDBM50350423
NameBDBM50350423
Synonyms:CHEMBL466154
TypeSmall organic molecule
Emp. Form.C14H10O5
Mol. Mass.258.2262
SMILESCc1cc(O)cc2oc3cc(O)cc(O)c3c(=O)c12