Reaction Details
TargetSerine/threonine-protein kinase N1
LigandBDBM50350424
Substrate/Competitorn/a
Meas. Tech.ChEMBL_762505 (CHEMBL1816875)
IC50 45300±n/a nM
Citation Ebada, SSSchulz, BWray, VTotzke, FKubbutat, MHMüller, WEHamacher, AKassack, MULin, WProksch, P Arthrinins A-D: novel diterpenoids and further constituents from the sponge derived fungus Arthrinium sp. Bioorg Med Chem19:4644-51 (2011) 
 
Serine/threonine-protein kinase N1
Name:Serine/threonine-protein kinase N1
Type:PROTEIN
Mol. Mass.:103928.39
Organism:Homo sapiens (Human)
Description:ChEMBL_1433150
Residue:942
BDBM50350424
NameBDBM50350424
Synonyms:CHEMBL454440
TypeSmall organic molecule
Emp. Form.C14H10O6
Mol. Mass.274.2256
SMILESCc1c(O)c(O)cc2oc3cc(O)cc(O)c3c(=O)c12