Reaction Details
TargetCarbonic anhydrase 2
LigandBDBM10886
Substrate/Competitorn/a
Meas. Tech.ChEMBL_762737 (CHEMBL1815988)
pH7.5±n/a
Ki 9.00±n/a nM
Commentsextracted
Citation Nishimori, IMinakuchi, TVullo, DScozzafava, ASupuran, CT Inhibition studies of theß-carbonic anhydrases from the bacterial pathogen Salmonella enterica serovar Typhimurium with sulfonamides and sulfamates. Bioorg Med Chem19:5023-30 (2011) 
 
Carbonic anhydrase 2
Name:Carbonic anhydrase 2
Type:Enzyme
Mol. Mass.:29250.71
Organism:Homo sapiens (Human)
Description:P00918
Residue:260
BDBM10886
NameBDBM10886
Synonyms:2-N-benzene-1,3,4-thiadiazole-2,5-disulfonamide Benzolamide CHEMBL73962
TypeSmall organic molecule
Emp. Form.C8H8N4O4S3
Mol. Mass.320.369
SMILESNS(=O)(=O)c1nnc(NS(=O)(=O)c2ccccc2)s1