Reaction Details
TargetTranscriptional activator protein LuxR
LigandBDBM50350648
Substrate/Competitorn/a
Meas. Tech.ChEMBL_762416 (CHEMBL1816589)
IC50 6100±n/a nM
Citation Sabbah, MSoulère, LReverchon, SQueneau, YDoutheau, A LuxR dependent quorum sensing inhibition by N,N'-disubstituted imidazolium salts. Bioorg Med Chem19:4868-75 (2011) 
 
Transcriptional activator protein LuxR
Name:Transcriptional activator protein LuxR
Type:PROTEIN
Mol. Mass.:28563.86
Organism:Vibrio fischeri
Description:ChEMBL_831639
Residue:250
BDBM50350648
NameBDBM50350648
Synonyms:CHEMBL1813535
TypeSmall organic molecule
Emp. Form.C28H39N2
Mol. Mass.403.6221
SMILESCCCCCCCCCCCCn1cc[n+](c1)C(c1ccccc1)c1ccccc1