Reaction Details
TargetTranscriptional activator protein LuxR
LigandBDBM50350649
Substrate/Competitorn/a
Meas. Tech.ChEMBL_762416 (CHEMBL1816589)
IC50 5200±n/a nM
Citation Sabbah, MSoulère, LReverchon, SQueneau, YDoutheau, A LuxR dependent quorum sensing inhibition by N,N'-disubstituted imidazolium salts. Bioorg Med Chem19:4868-75 (2011) 
 
Transcriptional activator protein LuxR
Name:Transcriptional activator protein LuxR
Type:PROTEIN
Mol. Mass.:28563.86
Organism:Vibrio fischeri
Description:ChEMBL_831639
Residue:250
BDBM50350649
NameBDBM50350649
Synonyms:CHEMBL1813536
TypeSmall organic molecule
Emp. Form.C30H43N2
Mol. Mass.431.6753
n1cc[n+](c1)C(c1ccccc1)c1ccccc1