Reaction Details
TargetTranscriptional activator protein LuxR
LigandBDBM50350669
Substrate/Competitorn/a
Meas. Tech.ChEMBL_762416 (CHEMBL1816589)
IC50 4900±n/a nM
Citation Sabbah, MSoulère, LReverchon, SQueneau, YDoutheau, A LuxR dependent quorum sensing inhibition by N,N'-disubstituted imidazolium salts. Bioorg Med Chem19:4868-75 (2011) 
 
Transcriptional activator protein LuxR
Name:Transcriptional activator protein LuxR
Type:PROTEIN
Mol. Mass.:28563.86
Organism:Vibrio fischeri
Description:ChEMBL_831639
Residue:250
BDBM50350669
NameBDBM50350669
Synonyms:CHEMBL1813546
TypeSmall organic molecule
Emp. Form.C26H31Cl4N2
Mol. Mass.513.349
SMILESCCCCCCCCCCn1cc[n+](c1)C(c1ccc(Cl)cc1Cl)c1ccc(Cl)cc1Cl