Reaction Details
TargetGlycogen phosphorylase, muscle form
LigandBDBM50350688
Substrate/Competitorn/a
Meas. Tech.ChEMBL_762684 (CHEMBL1817502)
IC50 3200±n/a nM
Citation Habash, MTaha, MO Ligand-based modelling followed by synthetic exploration unveil novel glycogen phosphorylase inhibitory leads. Bioorg Med Chem19:4746-71 (2011) 
 
Glycogen phosphorylase, muscle form
Name:Glycogen phosphorylase, muscle form
Type:Enzyme
Mol. Mass.:97296.32
Organism:Oryctolagus cuniculus (rabbit)
Description:Phosphorylation of Ser-15 converts phosphorylase B (unphosphorylated) to phosphorylase A.
Residue:843
BDBM50350688
NameBDBM50350688
Synonyms:CHEMBL1814498
TypeSmall organic molecule
Emp. Form.C18H11ClN2O
Mol. Mass.306.746
SMILESClc1cccc(c1)-c1nnc(o1)-c1ccc2ccccc2c1