Reaction Details
TargetProthrombin
LigandBDBM50350699
Substrate/Competitorn/a
Meas. Tech.ChEMBL_762730 (CHEMBL1815981)
Kd 300±n/a nM
Citation Jensen, TBHenriksen, JRRasmussen, BERasmussen, LMAndresen, TLWengel, JPasternak, A Thermodynamic and biological evaluation of a thrombin binding aptamer modified with several unlocked nucleic acid (UNA) monomers and a 2'-C-piperazino-UNA monomer. Bioorg Med Chem19:4739-45 (2011) 
 
Prothrombin
Name:Prothrombin
Type:Protein
Mol. Mass.:70029.57
Organism:Homo sapiens (Human)
Description:P00734
Residue:622
BDBM50350699
NameBDBM50350699
Synonyms:CHEMBL1814822
TypeSmall organic molecule
Emp. Form.C158H215N73O84P14S
Mol. Mass.4946.534
SMILESCc1cn([C@H]2C[C@H](OP(N)(=O)OC[C@H]3O[C@H](C[C@@H]3OP(N)(=O)OC[C@H]3O[C@H](C[C@@H]3O)n3cnc4c3nc(N)[nH]c4=O)n3cnc4c3nc(N)[nH]c4=O)[C@@H](COP(N)(=O)OC[C@@H](COP(N)(=O)O[C@H]3C[C@@H](O[C@@H]3COP(N)(=O)O[C@H]3C[C@@H](O[C@@H]3COP(N)(=O)O[C@H]3C[C@@H](O[C@@H]3COP(N)(=O)O[C@H]3C[C@@H](O[C@@H]3COP(N)(=O)OC[C@@H](COP(N)(=O)O[C@H]3C[C@@H](O[C@@H]3COP(N)(=O)O[C@@H]3C[C@@H](COP(N)(=O)O[C@H]4C[C@@H](O[C@@H]4COP(N)(=O)O[C@H]4C[C@@H](O[C@@H]4COP(N)(=O)O[C@H]4C[C@@H](O[C@@H]4COP(N)(=O)O[C@H]4C[C@@H](O[C@@H]4COC(=O)CCCC[C@@H]4SC[C@@H]5NC(=O)N[C@H]45)n4cnc5c4nc(N)[nH]c5=O)n4cnc5c4nc(N)[nH]c5=O)n4cc(C)c(=O)[nH]c4=O)n4cc(C)c(=O)[nH]c4=O)O[C@H]3n3cnc4c3nc(N)[nH]c4=O)n3cnc4c3nc(N)[nH]c4=O)O[C@H](CO)n3ccc(=O)[nH]c3=O)n3cnc4c3nc(N)[nH]c4=O)n3cc(C)c(=O)[nH]c3=O)n3cnc4c3nc(N)[nH]c4=O)n3cnc4c3nc(N)[nH]c4=O)O[C@H](CO)n3ccc(=O)[nH]c3=O)O2)c(=O)[nH]c1=O