Reaction Details
TargetPhospho-2-dehydro-3-deoxyheptonate aldolase, Phe-sensitive
LigandBDBM50350723
Substrate/Competitorn/a
Meas. Tech.ChEMBL_762858 (CHEMBL1820675)
Ki 270000±n/a nM
Citation Walker, SRJiao, WParker, EJ Synthesis and evaluation of dual site inhibitors of 3-deoxy-D-arabino-heptulosonate 7-phosphate synthase. Bioorg Med Chem Lett21:5092-7 (2011) 
 
Phospho-2-dehydro-3-deoxyheptonate aldolase, Phe-sensitive
Name:Phospho-2-dehydro-3-deoxyheptonate aldolase, Phe-sensitive
Type:PROTEIN
Mol. Mass.:38009.60
Organism:Escherichia coli (strain K12)
Description:ChEMBL_762857
Residue:350
BDBM50350723
NameBDBM50350723
Synonyms:CHEMBL1255768 | CHEMBL1818156
TypeSmall organic molecule
Emp. Form.C4H7O5P
Mol. Mass.166.0691
SMILESCC(=CP(O)(O)=O)C(O)=O