Reaction Details
TargetCytochrome P450 3A4
LigandBDBM50350728
Substrate/Competitorn/a
Meas. Tech.ChEMBL_762993 (CHEMBL1820810)
IC50 2400±n/a nM
Citation Bengtsson, CBlaho, SSaitton, DBBrickmann, KBroddefalk, JDavidsson, ODrmota, TFolmer, RHallberg, KHallén, SHovland, RIsin, EJohannesson, PKull, BLarsson, LOLöfgren, LNilsson, KENoeske, TOakes, NPlowright, ATSchnecke, VStåhlberg, PSörme, PWan, HWellner, EOster, L Design of small molecule inhibitors of acetyl-CoA carboxylase 1 and 2 showing reduction of hepatic malonyl-CoA levels in vivo in obese Zucker rats. Bioorg Med Chem19:3039-53 (2011) 
 
Cytochrome P450 3A4
Name:Cytochrome P450 3A4
Type:Enzyme
Mol. Mass.:57349.57
Organism:Homo sapiens (Human)
Description:n/a
Residue:503
BDBM50350728
NameBDBM50350728
Synonyms:CHEMBL1818291
TypeSmall organic molecule
Emp. Form.C30H38N4O3
Mol. Mass.502.6477
SMILESCC(C)(C)OC(=O)NC[C@H]1CC[C@H](CNC(=O)c2cc(nc3ccccc23)-c2cccc(CN)c2)CC1