Reaction Details
TargetLactase/phlorizin hydrolase
LigandBDBM50350758
Substrate/Competitorn/a
Meas. Tech.ChEMBL_763052 (CHEMBL1820869)
IC50 510±n/a nM
Citation Kato, AMiyauchi, SKato, NNash, RJYoshimura, YNakagome, IHirono, STakahata, HAdachi, I Docking and SAR studies of D- and L-isofagomine isomers as humanß-glucocerebrosidase inhibitors. Bioorg Med Chem19:3558-68 (2011) 
 
Lactase/phlorizin hydrolase
Name:Lactase/phlorizin hydrolase
Type:PROTEIN
Mol. Mass.:217253.31
Organism:Rattus norvegicus
Description:ChEMBL_96426
Residue:1928
BDBM50350758
NameBDBM50350758
Synonyms:CHEMBL1818433
TypeSmall organic molecule
Emp. Form.C6H13NO3
Mol. Mass.147.1723
SMILESOC[C@H]1CNC[C@@H](O)[C@H]1O