Reaction Details
TargetThymidylate synthase
LigandBDBM50040861
Substrate/Competitorn/a
Meas. Tech.ChEMBL_763104 (CHEMBL1819659)
IC50 32±n/a nM
Citation Zhang, XZhou, XKisliuk, RLPiraino, JCody, VGangjee, A Design, synthesis, biological evaluation and X-ray crystal structure of novel classical 6,5,6-tricyclic benzo[4,5]thieno[2,3-d]pyrimidines as dual thymidylate synthase and dihydrofolate reductase inhibitors. Bioorg Med Chem19:3585-94 (2011) 
 
Thymidylate synthase
Name:Thymidylate synthase
Type:Enzyme
Mol. Mass.:35718.07
Organism:Homo sapiens (Human)
Description:n/a
Residue:313
BDBM50040861
NameBDBM50040861
Synonyms:(S)-2-(5-(((1,2-DIHYDRO-3-METHYL-1-OXOBENZO(F)QUINAZOLIN-9-YL)METHYL)AMINO)1-OXO-2-ISOINDOLINYL)GLUTARIC ACID CHEMBL169896 TCMDC-131928
TypeSmall organic molecule
Emp. Form.C27H24N4O6
Mol. Mass.500.5027
SMILESCc1nc2ccc3ccc(CNc4ccc5C(=O)N(Cc5c4)[C@@H](CCC(O)=O)C(O)=O)cc3c2c(=O)[nH]1