Reaction Details
TargetPotassium voltage-gated channel subfamily H member 2
LigandBDBM50350777
Substrate/Competitorn/a
Meas. Tech.ChEMBL_763220 (CHEMBL1820233)
IC50 100±n/a nM
Citation Fischer, CZultanski, SLZhou, HMethot, JLBrown, WCMampreian, DMSchell, AJShah, SNuthall, HHughes, BLSmotrov, NKenific, CMCruz, JCWalker, DBouthillette, MNikov, GNSavage, DFJeliazkova-Mecheva, VVDiaz, DSzewczak, AABays, NMiddleton, REMunoz, BShearman, MS Triazoles as¿-secretase modulators. Bioorg Med Chem Lett21:4083-7 (2011) 
 
Potassium voltage-gated channel subfamily H member 2
Name:Potassium voltage-gated channel subfamily H member 2
Type:Multi-pass membrane protein
Mol. Mass.:126672.65
Organism:Homo sapiens (Human)
Description:Q12809
Residue:1159
BDBM50350777
NameBDBM50350777
Synonyms:CHEMBL1818827
TypeSmall organic molecule
Emp. Form.C20H17Br2N5O
Mol. Mass.503.19
SMILESCOc1cc(ccc1-n1cnc(C)c1)-c1cn(Cc2cc(Br)cc(Br)c2)nn1