Reaction Details
TargetKappa-type opioid receptor
LigandBDBM50350967
Substrate/Competitorn/a
Meas. Tech.ChEMBL_763652 (CHEMBL1820178)
Ki 75±n/a nM
Citation Verhoest, PRBasak, ASParikh, VHayward, MKauffman, GWParadis, VMcHardy, SFMcLean, SGrimwood, SSchmidt, AWVanase-Frawley, MFreeman, JVan Deusen, JCox, LWong, DLiras, S Design and discovery of a selective small molecule¿ opioid antagonist (2-methyl-N-((2'-(pyrrolidin-1-ylsulfonyl)biphenyl-4-yl)methyl)propan-1-amine, PF-4455242). J Med Chem54:5868-77 (2011) 
 
Kappa-type opioid receptor
Name:Kappa-type opioid receptor
Type:G Protein-Coupled Receptor (GPCR)
Mol. Mass.:42648.76
Organism:Homo sapiens (Human)
Description:P41145
Residue:380
BDBM50350967
NameBDBM50350967
Synonyms:CHEMBL1818228
TypeSmall organic molecule
Emp. Form.C22H31N3O2S
Mol. Mass.401.565
SMILESCC(C)(C)CCNCc1ccc(cc1)-c1cnccc1S(=O)(=O)N1CCCC1