Reaction Details
TargetMu-type opioid receptor
LigandBDBM50350987
Substrate/Competitorn/a
Meas. Tech.ChEMBL_763653 (CHEMBL1820179)
Ki 94±n/a nM
Citation Verhoest, PRBasak, ASParikh, VHayward, MKauffman, GWParadis, VMcHardy, SFMcLean, SGrimwood, SSchmidt, AWVanase-Frawley, MFreeman, JVan Deusen, JCox, LWong, DLiras, S Design and discovery of a selective small molecule¿ opioid antagonist (2-methyl-N-((2'-(pyrrolidin-1-ylsulfonyl)biphenyl-4-yl)methyl)propan-1-amine, PF-4455242). J Med Chem54:5868-77 (2011) 
 
Mu-type opioid receptor
Name:Mu-type opioid receptor
Type:G Protein-Coupled Receptor (GPCR)
Mol. Mass.:44789.51
Organism:Homo sapiens (Human)
Description:P35372
Residue:400
BDBM50350987
NameBDBM50350987
Synonyms:CHEMBL1818233
TypeSmall organic molecule
Emp. Form.C23H30N2O3S
Mol. Mass.414.561
SMILESCC1(O)CCN(Cc2ccc(cc2)-c2ccccc2S(=O)(=O)N2CCCC2)CC1