Reaction Details
Target5-hydroxytryptamine receptor 1A
LigandBDBM50351070
Substrate/Competitorn/a
Meas. Tech.ChEMBL_763995 (CHEMBL1820078)
Ki>10000±n/a nM
Citation Pittalà, VSiracusa, MAModica, MNSalerno, LPedretti, AVistoli, GCagnotto, AMennini, TRomeo, G Synthesis and molecular modeling of 1H-pyrrolopyrimidine-2,4-dione derivatives as ligands for thea1-adrenoceptors. Bioorg Med Chem19:5260-76 (2011) 
 
5-hydroxytryptamine receptor 1A
Name:5-hydroxytryptamine receptor 1A
Type:G Protein-Coupled Receptor (GPCR)
Mol. Mass.:46445.29
Organism:Rattus norvegicus (rat)
Description:Binding assays were performed using rat hippocampal membranes.
Residue:422
BDBM50351070
NameBDBM50351070
Synonyms:CHEMBL1819460
TypeSmall organic molecule
Emp. Form.C24H23Cl2N5O2
Mol. Mass.484.378
SMILESClc1ccc(cc1)-c1c[nH]c2c1[nH]c(=O)n(CCN1CCN(CC1)c1ccccc1Cl)c2=O