Reaction Details
TargetCarbonic anhydrase 9
LigandBDBM50351143
Substrate/Competitorn/a
Meas. Tech.ChEMBL_764118 (CHEMBL1821329)
Ki 8.7±n/a nM
Citation Brzozowski, ZSlawinski, JGdaniec, MInnocenti, ASupuran, CT Carbonic anhydrase inhibitors. Synthesis, molecular structures, and inhibition of the human cytosolic isozymes I and II and transmembrane isozymes IX, XII (cancer-associated) and XIV with novel 3-pyridinesulfonamide derivatives. Eur J Med Chem46:4403-10 (2011) 
 
Carbonic anhydrase 9
Name:Carbonic anhydrase 9
Type:Enzyme
Mol. Mass.:49669.03
Organism:Homo sapiens (Human)
Description:Catalytic domain of human cloned isozyme was used in the assay
Residue:459
BDBM50351143
NameBDBM50351143
Synonyms:CHEMBL1817906
TypeSmall organic molecule
Emp. Form.C16H15N5O5S2
Mol. Mass.421.451
SMILESCOC1=CC=CC2N1c1ccncc1S(=O)(=O)N2c1ccncc1S(N)(=O)=O