Reaction Details
TargetCarbonic anhydrase 14
LigandBDBM50351142
Substrate/Competitorn/a
Meas. Tech.ChEMBL_764120 (CHEMBL1821331)
Ki 80.6±n/a nM
Citation Brzozowski, ZSlawinski, JGdaniec, MInnocenti, ASupuran, CT Carbonic anhydrase inhibitors. Synthesis, molecular structures, and inhibition of the human cytosolic isozymes I and II and transmembrane isozymes IX, XII (cancer-associated) and XIV with novel 3-pyridinesulfonamide derivatives. Eur J Med Chem46:4403-10 (2011) 
 
Carbonic anhydrase 14
Name:Carbonic anhydrase 14
Type:Enzyme
Mol. Mass.:37665.67
Organism:Homo sapiens (Human)
Description:Human (cloned) isozyme.
Residue:337
BDBM50351142
NameBDBM50351142
Synonyms:CHEMBL1817907
TypeSmall organic molecule
Emp. Form.C10H9N3O3S
Mol. Mass.251.262
SMILESNS(=O)(=O)c1cnccc1-n1ccccc1=O