Reaction Details
TargetKinesin-like protein KIF11
LigandBDBM50351256
Substrate/Competitorn/a
Meas. Tech.ChEMBL_764353 (CHEMBL1820905)
IC50 310±n/a nM
Citation Rodriguez, DRamesh, CHenson, LHWilmeth, LBryant, BKKadavakollu, SHirsch, RMontoya, JHowell, PRGeorge, JMAlexander, DJohnson, DLArterburn, JBShuster, CB Synthesis and characterization of tritylthioethanamine derivatives with potent KSP inhibitory activity. Bioorg Med Chem19:5446-53 (2011) 
 
Kinesin-like protein KIF11
Name:Kinesin-like protein KIF11
Type:PROTEIN
Mol. Mass.:119138.97
Organism:Homo sapiens (Human)
Description:ChEMBL_1457426
Residue:1056
BDBM50351256
NameBDBM50351256
Synonyms:CHEMBL1818526
TypeSmall organic molecule
Emp. Form.C22H23NOS
Mol. Mass.349.489
SMILESN[C@H](CO)CSC(c1ccccc1)(c1ccccc1)c1ccccc1