Reaction Details
TargetProtein kinase C alpha type
LigandBDBM50099066
Substrate/Competitorn/a
Meas. Tech.ChEMBL_764634 (CHEMBL1821186)
EC50 1700000±n/a nM
Citation Das, JPany, SMajhi, A Chemical modifications of resveratrol for improved protein kinase C alpha activity. Bioorg Med Chem19:5321-33 (2011) 
 
Protein kinase C alpha type
Name:Protein kinase C alpha type
Type:Enzyme
Mol. Mass.:76755.65
Organism:Homo sapiens (Human)
Description:The recombinant human PKC enzymes were produced using a baculovirus expression system in SF9 cells
Residue:672
BDBM50099066
NameBDBM50099066
Synonyms:CHEMBL279115 | phorbol 13-acetate 12-myristate
TypeSmall organic molecule
Emp. Form.C36H56O8
Mol. Mass.616.825
(=O)O[C@@H]1[C@@H](C)[C@]2(O)[C@@H]3C=C(C)C(=O)[C@@]3(O)CC(CO)=C[C@H]2[C@@H]2C(C)(C)[C@]12OC(C)=O