Reaction Details
TargetProstaglandin E2 receptor EP4 subtype
LigandBDBM50351484
Substrate/Competitorn/a
Meas. Tech.ChEMBL_764673 (CHEMBL1821225)
Ki>10000±n/a nM
Citation Iwahashi, MTakahashi, ETanaka, MMatsunaga, YOkada, YMatsumoto, RNambu, FNakai, HToda, M Design and synthesis of new prostaglandin D2 receptor antagonists. Bioorg Med Chem19:5361-71 (2011) 
 
Prostaglandin E2 receptor EP4 subtype
Name:Prostaglandin E2 receptor EP4 subtype
Type:G-protein coupled receptor
Mol. Mass.:56175.66
Organism:Mus musculus (Mouse)
Description:n/a
Residue:513
BDBM50351484
NameBDBM50351484
Synonyms:CHEMBL1819623
TypeSmall organic molecule
Emp. Form.C25H22ClFN2O5
Mol. Mass.484.904
SMILESCN1C[C@@H](COc2ccc(C(=O)Nc3cc(CC(O)=O)ccc3F)c(Cl)c2)Oc2ccccc12