Reaction Details
TargetProstaglandin E2 receptor EP3 subtype
LigandBDBM50351480
Substrate/Competitorn/a
Meas. Tech.ChEMBL_764672 (CHEMBL1821224)
Ki>10000±n/a nM
Citation Iwahashi, MTakahashi, ETanaka, MMatsunaga, YOkada, YMatsumoto, RNambu, FNakai, HToda, M Design and synthesis of new prostaglandin D2 receptor antagonists. Bioorg Med Chem19:5361-71 (2011) 
 
Prostaglandin E2 receptor EP3 subtype
Name:Prostaglandin E2 receptor EP3 subtype
Type:G-protein coupled receptor
Mol. Mass.:40092.50
Organism:Mus musculus (Mouse)
Description:n/a
Residue:365
BDBM50351480
NameBDBM50351480
Synonyms:CHEMBL1819608
TypeSmall organic molecule
Emp. Form.C26H26N2O5
Mol. Mass.446.495
SMILESCN1C[C@@H](COc2ccc(C(=O)Nc3cccc(CC(O)=O)c3)c(C)c2)Oc2ccccc12