Reaction Details
TargetProstaglandin E2 receptor EP3 subtype
LigandBDBM50351481
Substrate/Competitorn/a
Meas. Tech.ChEMBL_764672 (CHEMBL1821224)
Ki>10000±n/a nM
Citation Iwahashi, MTakahashi, ETanaka, MMatsunaga, YOkada, YMatsumoto, RNambu, FNakai, HToda, M Design and synthesis of new prostaglandin D2 receptor antagonists. Bioorg Med Chem19:5361-71 (2011) 
 
Prostaglandin E2 receptor EP3 subtype
Name:Prostaglandin E2 receptor EP3 subtype
Type:G-protein coupled receptor
Mol. Mass.:40092.50
Organism:Mus musculus (Mouse)
Description:n/a
Residue:365
BDBM50351481
NameBDBM50351481
Synonyms:CHEMBL1819611
TypeSmall organic molecule
Emp. Form.C27H28N2O5
Mol. Mass.460.5216
SMILESCN1C[C@@H](COc2ccc(C(=O)Nc3cc(CC(O)=O)ccc3C)c(C)c2)Oc2ccccc12