Reaction Details
TargetProstaglandin F2-alpha receptor
LigandBDBM50351484
Substrate/Competitorn/a
Meas. Tech.ChEMBL_764677 (CHEMBL1821229)
Ki>10000±n/a nM
Citation Iwahashi, MTakahashi, ETanaka, MMatsunaga, YOkada, YMatsumoto, RNambu, FNakai, HToda, M Design and synthesis of new prostaglandin D2 receptor antagonists. Bioorg Med Chem19:5361-71 (2011) 
 
Prostaglandin F2-alpha receptor
Name:Prostaglandin F2-alpha receptor
Type:Enzyme Catalytic Domain
Mol. Mass.:40714.02
Organism:MOUSE
Description:ProstaglandinF2Alpha PTGFR MOUSE::P43117
Residue:366
BDBM50351484
NameBDBM50351484
Synonyms:CHEMBL1819623
TypeSmall organic molecule
Emp. Form.C25H22ClFN2O5
Mol. Mass.484.904
SMILESCN1C[C@@H](COc2ccc(C(=O)Nc3cc(CC(O)=O)ccc3F)c(Cl)c2)Oc2ccccc12