Reaction Details
TargetThromboxane A2 receptor
LigandBDBM50152515
Substrate/Competitorn/a
Meas. Tech.ChEMBL_764678 (CHEMBL1821230)
Ki 260±n/a nM
Citation Iwahashi, MTakahashi, ETanaka, MMatsunaga, YOkada, YMatsumoto, RNambu, FNakai, HToda, M Design and synthesis of new prostaglandin D2 receptor antagonists. Bioorg Med Chem19:5361-71 (2011) 
 
Thromboxane A2 receptor
Name:Thromboxane A2 receptor
Type:Enyzme
Mol. Mass.:37445.28
Organism:Homo sapiens (Human)
Description:P21731
Residue:343
BDBM50152515
NameBDBM50152515
Synonyms:CHEMBL364841 | {2-Methyl-1-[4-(4-methyl-3,4-dihydro-2H-benzo[1,4]oxazin-2-ylmethoxy)-benzoyl]-1H-indol-4-yl}-acetic acid
TypeSmall organic molecule
Emp. Form.C28H26N2O5
Mol. Mass.470.5164
SMILESCN1C[C@@H](COc2ccc(cc2)C(=O)n2c(C)cc3c(CC(O)=O)cccc23)Oc2ccccc12