Reaction Details
TargetProstacyclin receptor
LigandBDBM50351480
Substrate/Competitorn/a
Meas. Tech.ChEMBL_764674 (CHEMBL1821226)
Ki 3600±n/a nM
Citation Iwahashi, MTakahashi, ETanaka, MMatsunaga, YOkada, YMatsumoto, RNambu, FNakai, HToda, M Design and synthesis of new prostaglandin D2 receptor antagonists. Bioorg Med Chem19:5361-71 (2011) 
 
Prostacyclin receptor
Name:Prostacyclin receptor
Type:G Protein-Coupled Receptor (GPCR)
Mol. Mass.:40968.22
Organism:Homo sapiens (Human)
Description:The membranes prepared from human platelet were used in binding assay.
Residue:386
BDBM50351480
NameBDBM50351480
Synonyms:CHEMBL1819608
TypeSmall organic molecule
Emp. Form.C26H26N2O5
Mol. Mass.446.495
SMILESCN1C[C@@H](COc2ccc(C(=O)Nc3cccc(CC(O)=O)c3)c(C)c2)Oc2ccccc12