Reaction Details
TargetProstacyclin receptor
LigandBDBM50351483
Substrate/Competitorn/a
Meas. Tech.ChEMBL_764674 (CHEMBL1821226)
Ki 1600±n/a nM
Citation Iwahashi, MTakahashi, ETanaka, MMatsunaga, YOkada, YMatsumoto, RNambu, FNakai, HToda, M Design and synthesis of new prostaglandin D2 receptor antagonists. Bioorg Med Chem19:5361-71 (2011) 
 
Prostacyclin receptor
Name:Prostacyclin receptor
Type:G Protein-Coupled Receptor (GPCR)
Mol. Mass.:40968.22
Organism:Homo sapiens (Human)
Description:The membranes prepared from human platelet were used in binding assay.
Residue:386
BDBM50351483
NameBDBM50351483
Synonyms:CHEMBL1819622
TypeSmall organic molecule
Emp. Form.C25H22Cl2N2O5
Mol. Mass.501.359
SMILESCN1C[C@@H](COc2ccc(C(=O)Nc3cc(CC(O)=O)ccc3Cl)c(Cl)c2)Oc2ccccc12