Reaction Details
TargetProstaglandin D2 receptor
LigandBDBM50351489
Substrate/Competitorn/a
Meas. Tech.ChEMBL_764675 (CHEMBL1821227)
Ki 7.7±n/a nM
Citation Iwahashi, MTakahashi, ETanaka, MMatsunaga, YOkada, YMatsumoto, RNambu, FNakai, HToda, M Design and synthesis of new prostaglandin D2 receptor antagonists. Bioorg Med Chem19:5361-71 (2011) 
 
Prostaglandin D2 receptor
Name:Prostaglandin D2 receptor
Type:PROTEIN
Mol. Mass.:40018.63
Organism:Mus musculus
Description:ChEMBL_788408
Residue:357
BDBM50351489
NameBDBM50351489
Synonyms:CHEMBL1819614
TypeSmall organic molecule
Emp. Form.C26H25ClN2O5
Mol. Mass.480.94
SMILESCN1C[C@@H](COc2ccc(C(=O)Nc3cc(CC(O)=O)ccc3Cl)c(C)c2)Oc2ccccc12