Reaction Details
TargetProstaglandin D2 receptor
LigandBDBM50351498
Substrate/Competitorn/a
Meas. Tech.ChEMBL_764675 (CHEMBL1821227)
Ki 36±n/a nM
Citation Iwahashi, MTakahashi, ETanaka, MMatsunaga, YOkada, YMatsumoto, RNambu, FNakai, HToda, M Design and synthesis of new prostaglandin D2 receptor antagonists. Bioorg Med Chem19:5361-71 (2011) 
 
Prostaglandin D2 receptor
Name:Prostaglandin D2 receptor
Type:PROTEIN
Mol. Mass.:40018.63
Organism:Mus musculus
Description:ChEMBL_788408
Residue:357
BDBM50351498
NameBDBM50351498
Synonyms:CHEMBL1819625
TypeSmall organic molecule
Emp. Form.C26H25ClN2O6
Mol. Mass.496.94
SMILESCOc1ccc(NC(=O)c2ccc(OC[C@@H]3CN(C)c4ccccc4O3)cc2Cl)cc1CC(O)=O