Reaction Details
TargetTranscriptional activator protein LasR
LigandBDBM50351505
Substrate/Competitorn/a
Meas. Tech.ChEMBL_765230 (CHEMBL1827783)
IC50 45200±n/a nM
Citation Lowery, CASalzameda, NTSawada, DKaufmann, GFJanda, KD Medicinal chemistry as a conduit for the modulation of quorum sensing. J Med Chem53:7467-89 (2010) 
 
Transcriptional activator protein LasR
Name:Transcriptional activator protein LasR
Type:PROTEIN
Mol. Mass.:26618.24
Organism:Pseudomonas aeruginosa
Description:ChEMBL_1475312
Residue:239
BDBM50351505
NameBDBM50351505
Synonyms:CHEMBL1823935
TypeSmall organic molecule
Emp. Form.C18H28N2O4S
Mol. Mass.368.491
SMILESO=C(CCCCCCCCCCN=C=S)CC(=O)N[C@H]1CCOC1=O