Reaction Details
TargetTranscriptional activator protein LuxR
LigandBDBM50351508
Substrate/Competitorn/a
Meas. Tech.ChEMBL_765232 (CHEMBL1827785)
IC50 770±n/a nM
Citation Lowery, CASalzameda, NTSawada, DKaufmann, GFJanda, KD Medicinal chemistry as a conduit for the modulation of quorum sensing. J Med Chem53:7467-89 (2010) 
 
Transcriptional activator protein LuxR
Name:Transcriptional activator protein LuxR
Type:PROTEIN
Mol. Mass.:28563.86
Organism:Vibrio fischeri
Description:ChEMBL_831639
Residue:250
BDBM50351508
NameBDBM50351508
Synonyms:CHEMBL259352
TypeSmall organic molecule
Emp. Form.C12H21NO3
Mol. Mass.227.3
SMILESCCCCCCCC(=O)N[C@H]1CCOC1=O