Reaction Details
TargetTranscriptional activator protein LasR
LigandBDBM50266198
Substrate/Competitorn/a
Meas. Tech.ChEMBL_765283 (CHEMBL1827922)
IC50 4670±n/a nM
Citation Lowery, CASalzameda, NTSawada, DKaufmann, GFJanda, KD Medicinal chemistry as a conduit for the modulation of quorum sensing. J Med Chem53:7467-89 (2010) 
 
Transcriptional activator protein LasR
Name:Transcriptional activator protein LasR
Type:PROTEIN
Mol. Mass.:26618.24
Organism:Pseudomonas aeruginosa
Description:ChEMBL_1475312
Residue:239
BDBM50266198
NameBDBM50266198
Synonyms:(S)-N-(2-oxotetrahydrofuran-3-yl)-2-(4-(trifluoromethoxy)phenoxy)acetamide | CHEMBL503197
TypeSmall organic molecule
Emp. Form.C13H12F3NO5
Mol. Mass.319.2333
SMILESFC(F)(F)Oc1ccc(OCC(=O)N[C@H]2CCOC2=O)cc1