Reaction Details
TargetTranscriptional activator protein LasR
LigandBDBM50266163
Substrate/Competitorn/a
Meas. Tech.ChEMBL_765283 (CHEMBL1827922)
IC50 1720±n/a nM
Citation Lowery, CASalzameda, NTSawada, DKaufmann, GFJanda, KD Medicinal chemistry as a conduit for the modulation of quorum sensing. J Med Chem53:7467-89 (2010) 
 
Transcriptional activator protein LasR
Name:Transcriptional activator protein LasR
Type:PROTEIN
Mol. Mass.:26618.24
Organism:Pseudomonas aeruginosa
Description:ChEMBL_1475312
Residue:239
BDBM50266163
NameBDBM50266163
Synonyms:(S)-2-(4-iodophenyl)-N-(2-oxotetrahydrofuran-3-yl)acetamide | CHEMBL468790
TypeSmall organic molecule
Emp. Form.C12H12INO3
Mol. Mass.345.1331
SMILESIc1ccc(CC(=O)N[C@H]2CCOC2=O)cc1