Reaction Details
TargetTranscriptional activator protein LasR
LigandBDBM50351511
Substrate/Competitorn/a
Meas. Tech.ChEMBL_765284 (CHEMBL1827923)
EC50 150±n/a nM
Citation Lowery, CASalzameda, NTSawada, DKaufmann, GFJanda, KD Medicinal chemistry as a conduit for the modulation of quorum sensing. J Med Chem53:7467-89 (2010) 
 
Transcriptional activator protein LasR
Name:Transcriptional activator protein LasR
Type:PROTEIN
Mol. Mass.:26618.24
Organism:Pseudomonas aeruginosa
Description:ChEMBL_1475312
Residue:239
BDBM50351511
NameBDBM50351511
Synonyms:CHEMBL463321
TypeSmall organic molecule
Emp. Form.C12H19NO4
Mol. Mass.241.2836
SMILESCCCCCC(=O)CC(=O)N[C@H]1CCOC1=O