Reaction Details
TargetTranscriptional activator protein LuxR
LigandBDBM50241431
Substrate/Competitorn/a
Meas. Tech.ChEMBL_765231 (CHEMBL1827784)
EC50 350±n/a nM
Citation Lowery, CASalzameda, NTSawada, DKaufmann, GFJanda, KD Medicinal chemistry as a conduit for the modulation of quorum sensing. J Med Chem53:7467-89 (2010) 
 
Transcriptional activator protein LuxR
Name:Transcriptional activator protein LuxR
Type:PROTEIN
Mol. Mass.:28563.86
Organism:Vibrio fischeri
Description:ChEMBL_831639
Residue:250
BDBM50241431
NameBDBM50241431
Synonyms:(S)-2-(3-nitrophenyl)-N-(2-oxo-tetrahydrofuran-3-yl)acetamide CHEMBL405298
TypeSmall organic molecule
Emp. Form.C12H12N2O5
Mol. Mass.264.2341
SMILES[O-][N+](=O)c1cccc(CC(=O)N[C@H]2CCOC2=O)c1