Reaction Details
TargetCviR transcriptional regulator
LigandBDBM50351516
Substrate/Competitorn/a
Meas. Tech.ChEMBL_765227 (CHEMBL1827780)
IC50 377±n/a nM
Citation Lowery, CASalzameda, NTSawada, DKaufmann, GFJanda, KD Medicinal chemistry as a conduit for the modulation of quorum sensing. J Med Chem53:7467-89 (2010) 
 
CviR transcriptional regulator
Name:CviR transcriptional regulator
Synonyms:n/a
Type:PROTEIN
Mol. Mass.:29723.76
Organism:Chromobacterium violaceum
Description:ChEMBL_765227
Residue:265
BDBM50351516
NameBDBM50351516
Synonyms:CHEMBL1823953
TypeSmall organic molecule
Emp. Form.C14H16ClNO4
Mol. Mass.297.734
SMILESClc1ccc(OCCCC(=O)NC2CCOC2=O)cc1