Reaction Details
TargetTranscriptional activator protein TraR
LigandBDBM50266198
Substrate/Competitorn/a
Meas. Tech.ChEMBL_765233 (CHEMBL1827786)
IC50 460±n/a nM
Citation Lowery, CASalzameda, NTSawada, DKaufmann, GFJanda, KD Medicinal chemistry as a conduit for the modulation of quorum sensing. J Med Chem53:7467-89 (2010) 
 
Transcriptional activator protein TraR
Name:Transcriptional activator protein TraR
Type:PROTEIN
Mol. Mass.:26741.83
Organism:Rhizobium radiobacter
Description:ChEMBL_765233
Residue:234
BDBM50266198
NameBDBM50266198
Synonyms:(S)-N-(2-oxotetrahydrofuran-3-yl)-2-(4-(trifluoromethoxy)phenoxy)acetamide | CHEMBL503197
TypeSmall organic molecule
Emp. Form.C13H12F3NO5
Mol. Mass.319.2333
SMILESFC(F)(F)Oc1ccc(OCC(=O)N[C@H]2CCOC2=O)cc1