Reaction Details
TargetRicin
LigandBDBM50351569
Substrate/Competitorn/a
Meas. Tech.ChEMBL_764841 (CHEMBL1826784)
IC50 200000±n/a nM
Citation Pruet, JMJasheway, KRManzano, LABai, YAnslyn, EVRobertus, JD 7-Substituted pterins provide a new direction for ricin A chain inhibitors. Eur J Med Chem46:3608-15 (2011) 
 
Ricin
Name:Ricin
Synonyms:RICI_RICCO
Type:PROTEIN
Mol. Mass.:64090.82
Organism:Ricinus communis
Description:ChEMBL_1286970
Residue:576
BDBM50351569
NameBDBM50351569
Synonyms:CHEMBL1738820
TypeSmall organic molecule
Emp. Form.C7H5N5O3
Mol. Mass.207.1463
SMILESNc1nc2nc(cnc2c(=O)[nH]1)C(O)=O