Reaction Details
TargetRicin
LigandBDBM50351572
Substrate/Competitorn/a
Meas. Tech.ChEMBL_764841 (CHEMBL1826784)
IC50 380000±n/a nM
Citation Pruet, JMJasheway, KRManzano, LABai, YAnslyn, EVRobertus, JD 7-Substituted pterins provide a new direction for ricin A chain inhibitors. Eur J Med Chem46:3608-15 (2011) 
 
Ricin
Name:Ricin
Synonyms:RICI_RICCO
Type:PROTEIN
Mol. Mass.:64090.82
Organism:Ricinus communis
Description:ChEMBL_1286970
Residue:576
BDBM50351572
NameBDBM50351572
Synonyms:CHEMBL1738821
TypeSmall organic molecule
Emp. Form.C12H10N6O3
Mol. Mass.286.2462
SMILESNc1nc2nc(cnc2c(=O)[nH]1)C(=O)NCc1ccco1