Reaction Details
TargetRicin
LigandBDBM50351574
Substrate/Competitorn/a
Meas. Tech.ChEMBL_764841 (CHEMBL1826784)
IC50 200000±n/a nM
Citation Pruet, JMJasheway, KRManzano, LABai, YAnslyn, EVRobertus, JD 7-Substituted pterins provide a new direction for ricin A chain inhibitors. Eur J Med Chem46:3608-15 (2011) 
 
Ricin
Name:Ricin
Synonyms:RICI_RICCO
Type:PROTEIN
Mol. Mass.:64090.82
Organism:Ricinus communis
Description:ChEMBL_1286970
Residue:576
BDBM50351574
NameBDBM50351574
Synonyms:CHEMBL1825014
TypeSmall organic molecule
Emp. Form.C15H15N7O2
Mol. Mass.325.3253
SMILESNc1nc2nc(cnc2c(=O)[nH]1)C(=O)NCCNc1ccccc1