Reaction Details
TargetHepatocyte growth factor receptor
LigandBDBM28025
Substrate/Competitorn/a
Meas. Tech.ChEMBL_764847 (CHEMBL1826790)
IC50 3.8±n/a nM
Citation Xie, QQZhong, LPan, YLWang, XYZhou, JPDi-Wu, LHuang, QWang, YLYang, LLXie, HZYang, SY Combined SVM-based and docking-based virtual screening for retrieving novel inhibitors of c-Met. Eur J Med Chem46:3675-80 (2011) 
 
Hepatocyte growth factor receptor
Name:Hepatocyte growth factor receptor
Type:Protein
Mol. Mass.:155559.73
Organism:Homo sapiens (Human)
Description:P08581
Residue:1390
BDBM28025
NameBDBM28025
Synonyms:2-aminopyridine analogue, 4 | N-(4-{[2-amino-3-(3-aminoprop-1-yn-1-yl)pyridin-4-yl]oxy}-3-fluorophenyl)-1-(4-fluorophenyl)-2-oxo-1,2-dihydropyridine-3-carboxamide
TypeSmall organic molecule
Emp. Form.C26H19F2N5O3
Mol. Mass.487.4576
SMILESNCC#Cc1c(N)nccc1Oc1ccc(NC(=O)c2cccn(-c3ccc(F)cc3)c2=O)cc1F