Reaction Details
TargetHepatocyte growth factor receptor
LigandBDBM50351602
Substrate/Competitorn/a
Meas. Tech.ChEMBL_764847 (CHEMBL1826790)
IC50 100.0±n/a nM
Citation Xie, QQZhong, LPan, YLWang, XYZhou, JPDi-Wu, LHuang, QWang, YLYang, LLXie, HZYang, SY Combined SVM-based and docking-based virtual screening for retrieving novel inhibitors of c-Met. Eur J Med Chem46:3675-80 (2011) 
 
Hepatocyte growth factor receptor
Name:Hepatocyte growth factor receptor
Type:Protein
Mol. Mass.:155559.73
Organism:Homo sapiens (Human)
Description:P08581
Residue:1390
BDBM50351602
NameBDBM50351602
Synonyms:CHEMBL1822791
TypeSmall organic molecule
Emp. Form.C23H24BrN5O4
Mol. Mass.514.372
SMILESCN(C)CCNC(=O)c1cc2NC(=O)C(=NNC(=O)Cc3ccc4OCCc4c3)c2c(Br)c1