Reaction Details
TargetHepatocyte growth factor receptor
LigandBDBM24476
Substrate/Competitorn/a
Meas. Tech.ChEMBL_764847 (CHEMBL1826790)
IC50 4±n/a nM
Citation Xie, QQZhong, LPan, YLWang, XYZhou, JPDi-Wu, LHuang, QWang, YLYang, LLXie, HZYang, SY Combined SVM-based and docking-based virtual screening for retrieving novel inhibitors of c-Met. Eur J Med Chem46:3675-80 (2011) 
 
Hepatocyte growth factor receptor
Name:Hepatocyte growth factor receptor
Type:Protein
Mol. Mass.:155559.73
Organism:Homo sapiens (Human)
Description:P08581
Residue:1390
BDBM24476
NameBDBM24476
Synonyms:7-methoxy-4-{[6-(3,4,5-trifluorophenyl)-[1,2,4]triazolo[4,3-a]pyridazin-3-yl]methoxy}quinoline | Triazolopyridazine, 10f
TypeSmall organic molecule
Emp. Form.C22H14F3N5O2
Mol. Mass.437.3741
SMILESCOc1ccc2c(OCc3nnc4ccc(nn34)-c3cc(F)c(F)c(F)c3)ccnc2c1