Reaction Details
TargetHepatocyte growth factor receptor
LigandBDBM24452
Substrate/Competitorn/a
Meas. Tech.ChEMBL_764847 (CHEMBL1826790)
IC50 3.4±n/a nM
Citation Xie, QQZhong, LPan, YLWang, XYZhou, JPDi-Wu, LHuang, QWang, YLYang, LLXie, HZYang, SY Combined SVM-based and docking-based virtual screening for retrieving novel inhibitors of c-Met. Eur J Med Chem46:3675-80 (2011) 
 
Hepatocyte growth factor receptor
Name:Hepatocyte growth factor receptor
Type:Protein
Mol. Mass.:155559.73
Organism:Homo sapiens (Human)
Description:P08581
Residue:1390
BDBM24452
NameBDBM24452
Synonyms:1-cyclopropyl-N-(3-fluoro-4-{1H-pyrrolo[2,3-b]pyridin-4-yloxy}phenyl)-5-(4-fluorophenyl)-4-oxo-1,4-dihydropyridine-3-carboxamide | 4-pyridone analogue, 41
TypeSmall organic molecule
Emp. Form.C28H20F2N4O3
Mol. Mass.498.4802
SMILESFc1ccc(cc1)-c1cn(cc(C(=O)Nc2ccc(Oc3ccnc4[nH]ccc34)c(F)c2)c1=O)C1CC1