Reaction Details
TargetHepatocyte growth factor receptor
LigandBDBM28027
Substrate/Competitorn/a
Meas. Tech.ChEMBL_764847 (CHEMBL1826790)
IC50 3.4±n/a nM
Citation Xie, QQZhong, LPan, YLWang, XYZhou, JPDi-Wu, LHuang, QWang, YLYang, LLXie, HZYang, SY Combined SVM-based and docking-based virtual screening for retrieving novel inhibitors of c-Met. Eur J Med Chem46:3675-80 (2011) 
 
Hepatocyte growth factor receptor
Name:Hepatocyte growth factor receptor
Type:Protein
Mol. Mass.:155559.73
Organism:Homo sapiens (Human)
Description:P08581
Residue:1390
BDBM28027
NameBDBM28027
Synonyms:2-aminopyridine analogue, 6 | N-(4-{[2-amino-3-(hydroxymethyl)pyridin-4-yl]oxy}-3-fluorophenyl)-1-(4-fluorophenyl)-2-oxo-1,2-dihydropyridine-3-carboxamide
TypeSmall organic molecule
Emp. Form.C24H18F2N4O4
Mol. Mass.464.4209
SMILESNc1nccc(Oc2ccc(NC(=O)c3cccn(-c4ccc(F)cc4)c3=O)cc2F)c1CO