Reaction Details
TargetHepatocyte growth factor receptor
LigandBDBM24761
Substrate/Competitorn/a
Meas. Tech.ChEMBL_764847 (CHEMBL1826790)
IC50 71±n/a nM
Citation Xie, QQZhong, LPan, YLWang, XYZhou, JPDi-Wu, LHuang, QWang, YLYang, LLXie, HZYang, SY Combined SVM-based and docking-based virtual screening for retrieving novel inhibitors of c-Met. Eur J Med Chem46:3675-80 (2011) 
 
Hepatocyte growth factor receptor
Name:Hepatocyte growth factor receptor
Type:Protein
Mol. Mass.:155559.73
Organism:Homo sapiens (Human)
Description:P08581
Residue:1390
BDBM24761
NameBDBM24761
Synonyms:N-[(5-{4-[(6,7-dimethoxyquinolin-4-yl)oxy]-3-fluorophenyl}-1-methyl-6-oxo-1,6-dihydropyrimidin-2-yl)(phenyl)methyl]propanamide | pyrimidone, 39
TypeSmall organic molecule
Emp. Form.C32H29FN4O5
Mol. Mass.568.5949
SMILESCCC(=O)NC(c1ccccc1)c1ncc(-c2ccc(Oc3ccnc4cc(OC)c(OC)cc34)c(F)c2)c(=O)n1C