Reaction Details
TargetHepatocyte growth factor receptor
LigandBDBM24769
Substrate/Competitorn/a
Meas. Tech.ChEMBL_764847 (CHEMBL1826790)
IC50 4.9±n/a nM
Citation Xie, QQZhong, LPan, YLWang, XYZhou, JPDi-Wu, LHuang, QWang, YLYang, LLXie, HZYang, SY Combined SVM-based and docking-based virtual screening for retrieving novel inhibitors of c-Met. Eur J Med Chem46:3675-80 (2011) 
 
Hepatocyte growth factor receptor
Name:Hepatocyte growth factor receptor
Type:Protein
Mol. Mass.:155559.73
Organism:Homo sapiens (Human)
Description:P08581
Residue:1390
BDBM24769
NameBDBM24769
Synonyms:5-[3-fluoro-4-({6-methoxy-7-[3-(morpholin-4-yl)propoxy]quinolin-4-yl}oxy)phenyl]-2-[(4-fluorophenyl)amino]-3-methyl-3,4-dihydropyrimidin-4-one | pyrimidone, 51
TypeSmall organic molecule
Emp. Form.C34H33F2N5O5
Mol. Mass.629.6531
SMILESCOc1cc2c(Oc3ccc(cc3F)-c3cnc(Nc4ccc(F)cc4)n(C)c3=O)ccnc2cc1OCCCN1CCOCC1