Reaction Details
TargetTyrosine-protein phosphatase non-receptor type 1
LigandBDBM50351782
Substrate/Competitorn/a
Meas. Tech.ChEMBL_765397 (CHEMBL1828245)
IC50 2590±n/a nM
Citation Sun, LPShen, QPiao, HHMa, WPGao, LXZhang, WNan, FJLi, JPiao, HR Synthesis and biological evaluation of (±)-3-(2-(2-fluorobenzyloxy) naphthalen-6-yl)-2-aminopropanoic acid derivatives as novel PTP1B inhibitors. Eur J Med Chem46:3630-8 (2011) 
 
Tyrosine-protein phosphatase non-receptor type 1
Name:Tyrosine-protein phosphatase non-receptor type 1
Type:Protein phosphatase
Mol. Mass.:49963.76
Organism:Homo sapiens (Human)
Description:Human recombinant GST-fusion PTP1B (1-435).
Residue:435
BDBM50351782
NameBDBM50351782
Synonyms:CHEMBL1823956
TypeSmall organic molecule
Emp. Form.C29H23ClFNO4
Mol. Mass.503.949
SMILESOC(=O)C(Cc1ccc2cc(OCc3ccccc3F)ccc2c1)NC(=O)\C=C\c1ccc(Cl)cc1