Reaction Details
TargetTyrosine-protein phosphatase non-receptor type 2
LigandBDBM50351779
Substrate/Competitorn/a
Meas. Tech.ChEMBL_765398 (CHEMBL1828246)
IC50 5960±n/a nM
Citation Sun, LPShen, QPiao, HHMa, WPGao, LXZhang, WNan, FJLi, JPiao, HR Synthesis and biological evaluation of (±)-3-(2-(2-fluorobenzyloxy) naphthalen-6-yl)-2-aminopropanoic acid derivatives as novel PTP1B inhibitors. Eur J Med Chem46:3630-8 (2011) 
 
Tyrosine-protein phosphatase non-receptor type 2
Name:Tyrosine-protein phosphatase non-receptor type 2
Type:Protein
Mol. Mass.:48481.80
Organism:Homo sapiens (Human)
Description:P17706
Residue:415
BDBM50351779
NameBDBM50351779
Synonyms:CHEMBL1823761
TypeSmall organic molecule
Emp. Form.C29H23F2NO4
Mol. Mass.487.494
SMILESOC(=O)C(Cc1ccc2cc(OCc3ccccc3F)ccc2c1)NC(=O)\C=C\c1ccc(F)cc1