Reaction Details
TargetM-phase inducer phosphatase 2
LigandBDBM50351797
Substrate/Competitorn/a
Meas. Tech.ChEMBL_765399 (CHEMBL1828247)
IC50 4580±n/a nM
Citation Sun, LPShen, QPiao, HHMa, WPGao, LXZhang, WNan, FJLi, JPiao, HR Synthesis and biological evaluation of (±)-3-(2-(2-fluorobenzyloxy) naphthalen-6-yl)-2-aminopropanoic acid derivatives as novel PTP1B inhibitors. Eur J Med Chem46:3630-8 (2011) 
 
M-phase inducer phosphatase 2
Name:M-phase inducer phosphatase 2
Type:Protein
Mol. Mass.:64985.27
Organism:Homo sapiens (Human)
Description:n/a
Residue:580
BDBM50351797
NameBDBM50351797
Synonyms:CHEMBL1823759
TypeSmall organic molecule
Emp. Form.C29H23F2NO4
Mol. Mass.487.494
SMILESOC(=O)C(Cc1ccc2cc(OCc3ccccc3F)ccc2c1)NC(=O)\C=C\c1ccccc1F